{"text_format":"1","workbook":"xlsx","n_sheets":14,"sheets":["試算シートの使い方","入力シート","印刷シート","【参考】調整額区分表","特に級読替表","給料表計算シート","給料表","計算シート","Sheet1","Sheet2","Sheet3","除算","H30.4.1","育休特殊事例入力方法"],"not_rendered":{"charts":0,"images":15,"macros":1,"external_links":1,"defined_names":52,"comments":3,"pivot_tables":0},"unopened":[],"bounds":{"document_bytes":16777216,"sheet_cells":100000,"rows_first":2000,"rows_last":500,"rows_between":2000,"halvings":0,"cell_chars":16384,"cell_head_chars":4096},"cells_cut":0,"cells_raw":0,"read":"whole","date_system":"1900"}

{"sheet":"試算シートの使い方","index":0,"n_rows":81,"n_cols":8,"rows_kept":81,"cut":false,"hidden":false,"merged":[[0,0,0,8],[3,1,3,5],[4,1,4,5],[7,1,7,8],[1,7,1,8],[63,1,63,8],[64,1,64,8],[61,0,61,8],[78,1,78,2],[8,1,8,8]]}
["退職手当試算シートの使用について"]
[null,null,null,null,null,null,null,"R6.8.1 現在"]
["１　用意するもの"]
["（１）"," 履歴書"]
["（２）"," 給与明細（最新）"]
[]
["２　使用方法"]
["（１）"," 入力シートを開きます。"]
["（２）"," 入力シートの説明を参考に履歴書等を見ながら該当箇所に入力してください。"]
[]
["　　　 ※　不明な点は、所属の事務職員に確認するか、福利課企画管理班まで御連絡く"]
["　　　　　　ださい。（022-211-3672）"]
[]
[]
[]
{"$rows_left_out":67}
{"sheet":"入力シート","index":1,"n_rows":156,"n_cols":81,"rows_kept":156,"cut":false,"hidden":false,"merged":[[127,66,127,70],[148,31,148,64],[126,1,127,6],[126,7,127,14],[126,15,127,16],[126,17,127,24],[126,55,127,63],[126,64,127,64],[124,58,125,63],[124,64,125,64],[142,43,143,50],[138,43,139,50],[140,43,141,50],[130,7,131,12],[130,13,131,30],[134,21,135,22],[134,23,135,30],[130,1,131,6],[132,1,133,6],[134,1,135,6],[136,1,137,6],[138,1,139,6],[140,1,141,6],[142,7,143,12],[122,31,123,36],[124,31,125,36],[122,37,123,44],[124,37,125,44],[126,37,127,44],[122,45,123,48],[126,45,127,48],[126,25,127,30],[126,31,127,36],[122,7,123,14],[124,7,125,14],[124,1,125,6],[122,25,123,30],[124,25,125,30],[122,1,123,6],[122,17,123,24],[142,31,143,36],[142,37,143,42],[138,21,139,22],[138,23,139,30],[138,31,139,36],[138,37,139,42],[140,21,141,22],[140,23,141,30],[140,31,141,36],[140,37,141,42],[142,1,143,6],[138,7,139,12],[138,13,139,20],[140,7,141,12],[140,13,141,20],[134,7,135,12],[134,13,135,20],[142,13,143,20],[142,21,143,22],[142,23,143,30],[134,37,135,42],[134,43,135,50],[136,7,137,12],[136,13,137,20],[136,21,137,22],[136,23,137,30],[136,31,137,36],[136,37,137,42],[136,43,137,50],[134,31,135,36],[130,37,131,42],[130,43,131,50],[132,7,133,12],[132,13,133,20],[132,21,133,22],[132,23,133,30],[132,31,133,36],[132,37,133,42],[132,43,133,50],[130,31,131,36],[33,5,33,14],[33,15,33,28],[34,5,34,14],[34,15,34,28],[34,29,34,32],[34,33,34,46],[36,15,36,28],[37,29,37,42],[38,5,38,14],[37,26,37,28],[37,15,37,25],[37,5,37,14],[38,15,38,25],[38,26,38,28],[38,29,38,42],[118,31,119,36],[120,31,121,36],[114,1,115,6],[118,1,119,6],[120,1,121,6],[116,1,117,6],[120,7,121,14],[114,31,115,36],[118,7,119,14],[116,25,117,30],[118,17,119,24],[120,17,121,24],[124,17,125,24],[118,15,119,16],[120,15,121,16],[122,15,123,16],[124,15,125,16],[73,58,74,64],[73,20,74,32],[112,1,112,64],[69,52,70,55],[72,20,72,36],[69,33,70,36],[69,17,69,19],[118,25,119,30],[120,25,121,30],[118,45,119,48],[120,45,121,48],[111,1,111,64],[114,45,115,48],[114,7,115,24],[114,25,115,30],[116,7,117,14],[116,17,117,24],[116,15,117,16],[68,1,70,16],[20,1,21,14],[1,39,1,47],[12,1,13,13],[1,52,1,63],[3,1,3,63],[11,1,11,64],[12,16,12,53],[13,16,13,64],[8,17,9,33],[18,15,19,28],[18,61,19,64],[18,49,19,52],[5,1,5,57],[8,1,9,13],[7,1,7,13],[7,17,7,33],[18,35,19,48],[18,1,19,14],[20,15,21,28],[22,1,22,64],[23,1,23,64],[26,15,26,28],[30,5,30,14],[30,26,30,28],[30,15,30,25],[25,5,25,14],[28,15,28,28],[26,5,26,14],[29,61,29,64],[30,61,30,64],[29,29,29,42],[29,47,29,60],[29,15,29,25],[29,26,29,28],[25,15,25,28],[26,29,26,32],[26,33,26,46],[29,5,29,14],[30,29,30,42],[38,80,39,80],[38,79,39,79],[38,78,39,78],[38,77,39,77],[29,74,30,76],[30,65,30,69],[29,65,29,69],[29,70,29,73],[30,70,30,73],[37,74,38,76],[37,70,37,73],[68,20,68,36],[43,20,44,21],[46,1,46,64],[43,22,44,26],[43,27,44,28],[43,5,44,14],[63,39,63,47],[64,39,65,47],[63,1,63,17],[42,61,43,64],[42,31,43,47],[42,48,43,60],[64,33,65,36],[68,39,68,55],[42,15,42,28],[63,20,63,36],[42,1,44,4],[43,15,44,19],[147,55,147,58],[147,46,147,54],[140,64,141,64],[142,55,143,63],[142,64,143,64],[64,20,65,24],[64,25,65,27],[64,28,65,32],[64,52,65,55],[76,1,76,62],[78,1,78,62],[72,39,72,55],[64,1,65,17],[69,20,70,24],[69,25,70,27],[69,28,70,32],[67,39,67,55],[73,14,74,17],[73,33,74,36],[67,20,67,36],[124,52,125,57],[73,1,74,13],[140,52,141,57],[69,39,70,51],[145,31,146,47],[145,48,146,60],[140,58,141,63],[73,39,74,51],[73,52,74,55],[72,1,72,17],[77,1,77,62],[94,1,94,17],[94,20,94,36],[94,39,94,55],[95,1,96,13],[95,14,96,17],[95,20,96,32],[95,33,96,36],[95,39,96,51],[95,52,96,55],[95,58,96,64],[145,61,146,64],[116,45,117,48],[118,37,119,44],[120,37,121,44],[114,37,115,44],[116,37,117,44],[116,31,117,36],[42,72,42,77],[43,72,43,77],[18,66,19,66],[25,48,25,57],[26,48,26,52],[26,53,26,55],[26,56,26,61],[26,62,26,65],[33,48,33,57],[34,48,34,52],[34,53,34,55],[34,56,34,61],[34,62,34,65],[37,65,37,69],[37,61,37,64],[37,47,37,60],[38,47,38,60],[38,61,38,64],[38,65,38,69],[38,70,38,73],[30,47,30,60],[18,68,19,72],[18,53,19,56],[18,57,19,60]]}
[]
[null,"退職手当試算入力シート",null,null,null,null,null,null,null,null,null,null,null,null,null,null,null,null,null,null,null,null,null,null,null,null,null,null,null,null,null,null,null,null,null,null,null,null,null,"入力箇所(必須）",null,null,null,null,null,null,null,null,null,null,null,null,"入力箇所（場合によって）"]
[]
[null,"退職時のおおよその退職手当額を試算します。\n黄色セル、（場合によっては）青色セルに入力してください。"]
[]
[1,"試算希望者の氏名を入力してください。"]
[]
[null,"氏　　名"]
[null,"福　花子"]
[]
[]
[2,"退職事由を選んでください。（プルダウンから選択してください。）"]
[null,"定年扱い",null,null,null,null,null,null,null,null,null,null,null,null,null,null,"※退職事由によって退職手当額が大きく異なります。"]
[null,null,null,null,null,null,null,null,null,null,null,null,null,null,null,null,"※退職年月日が６０歳の誕生日以降であれば、定年扱いを選んでください。"]
[]
{"$rows_left_out":142}
{"sheet":"印刷シート","index":2,"n_rows":48,"n_cols":35,"rows_kept":48,"cut":false,"hidden":false,"merged":[[1,19,1,20],[1,14,1,18],[3,10,5,10],[6,10,16,10],[6,15,7,16],[2,14,2,18],[1,9,1,10],[2,9,2,10],[15,18,16,18],[15,19,16,19],[15,20,16,20],[8,15,9,16],[10,15,11,16],[12,15,13,16],[15,11,16,16],[14,11,14,13],[28,9,28,10],[15,17,16,17],[38,5,38,7],[39,5,39,7],[40,5,40,7],[34,5,34,7],[35,5,35,7],[36,5,36,7],[37,5,37,7],[26,13,26,15],[17,5,18,7],[17,8,18,8],[20,13,20,14],[27,9,27,10],[20,5,20,7],[40,2,40,4],[41,2,41,4],[43,5,43,7],[44,5,44,7],[45,5,45,7],[41,5,41,7],[42,5,42,7],[1,1,2,8],[31,5,33,7],[14,5,16,7],[14,8,16,8],[10,5,10,7],[31,8,33,8],[8,5,8,7],[11,5,11,7],[14,3,16,4],[7,5,7,7],[17,3,18,4],[31,1,33,4]]}
[]
[null,"退職手当計算内訳書　（試算）",null,null,null,null,null,null,null,"氏名：",null,{"$f":"IF(入力シート!B9=\"\",\"\",入力シート!B9)","v":"福　花子"},null,null,{"$f":"TODAY()","v":"2024-08-02"},null,null,null,null,"現在",null,null,null,null,null,null,null,{"$f":"IF(入力シート!B13=\"自己都合\",\"自己都合\",IF(入力シート!B13=\"定年扱い\",\"定年扱い\"))","v":"定年扱い"}]
[null,null,null,null,null,null,null,null,null,"事由：",null,{"$f":"$AB$2&\"退職\"","v":"定年扱い退職"}]
[null,"退","給",null,null,{"$f":"入力シート!B65","v":"教育（二）"},null,null,null,"勤","在職年数",{"$f":"入力シート!P19","v":"1989-04-01"},null,null,null,"から"]
[null,"職","料","級号俸",null,{"$f":"IF(入力シート!U65=\"\",\"\",IF(F8=入力シート!AN70,入力シート!U70,入力シート!U65))","v":3},"級",{"$f":"IF(入力シート!AC65=\"\",\"\",IF(F8=入力シート!AN70,入力シート!AC70,入力シート!AC65))","v":50},"号俸","続",null,{"$f":"入力シート!P21","v":"2025-03-31"},null,null,null,"まで",null,{"$f":"入力シート!$AX$19","v":36},"年",{"$f":"入力シート!$BF$19","v":0},"月"]
[null,"時","月",null,null,null,null,null,null,"年",null,"計(ｱ)",null,null,null,null,null,{"$f":"R5","v":36},"年",{"$f":"T5","v":0},"月",null,{"$f":"R6*12+T6","v":432}]
[null,"の","額",null,null,null,null,null,null,"数","除算年数",{"$f":"IF(AND(入力シート!$AW$27=0,入力シート!$BE$27=0),\"\",入力シート!AD30)","v":"1993-03-01"},"から",null,null,{"$f":"IF(L7=\"\",\"\",\"育休\")","v":"育休"}]
[null,"給",null,"給料(A)",null,{"$f":"入力シート!$B$74+入力シート!$B$96","v":392000},null,null,"円",null,null,{"$f":"IF(AND(入力シート!$AW$27=0,入力シート!$BE$27=0),\"\",入力シート!AV31)","v":"1994-03-31"},"まで",null,{"$f":"IF(P7=\"\",\"\",\"(1)\")","v":"(1)"},null,null,{"$f":"IF(P7=\"\",\"\",入力シート!AW27)","v":0},"年",{"$f":"IF(P7=\"\",\"\",入力シート!BE27)","v":4.8},"月"]
[null,"与",null,null,null,null,null,null,null,null,null,{"$f":"IF(AND(入力シート!$AW$35=0,入力シート!$BE$35=0),\"\",入力シート!AD38)","v":"2019-02-01"},"から",null,null,{"$f":"IF(L9=\"\",\"\",入力シート!$P$34)","v":"休職"}]
[null,"等",null,null,null,null,null,null,null,null,null,{"$f":"IF(AND(入力シート!AW35,入力シート!BE35=0),\"\",入力シート!AV38)","v":"2019-03-31"},"まで",null,{"$f":"IF(P9=\"\",\"\",\"(2)\")","v":"(2)"},null,null,{"$f":"IF(P9=\"\",\"\",入力シート!AW35)","v":0},"年",{"$f":"IF(P9=\"\",\"\",入力シート!BE35)","v":1},"月"]
[null,null,null,null,null,null,null,null,null,null,null,{"$f":"IF(AND(入力シート!P44=0,入力シート!W44=0),\"\",\"さらに除く年月数\")","v":"さらに除く年月数"},null,null,null,{"$f":"IF(L11=\"\",\"\",\"その他\")","v":"その他"},null,null,null,null,null,null,{"$f":"SUM(R8:R15)","v":1}]
[null,null,null,"教職調整額(B)",null,{"$f":"入力シート!$U$74+入力シート!$U$96","v":7500},null,null,"円",null,null,null,null,null,{"$f":"IF(P11=\"\",\"\",\"(3)\")","v":"(3)"},null,null,{"$f":"IF(P11=\"\",\"\",入力シート!P44)","v":1},"年",{"$f":"IF(P11=\"\",\"\",入力シート!W44)","v":2},"月",null,{"$f":"ROUNDDOWN((W15)/12,0)","v":0}]
[null,null,null,null,null,null,null,null,null,null,null,null,null,null,null,{"$f":"IF(L13=\"\",\"\",入力シート!#REF!)","v":""},null,null,null,null,null,null,{"$f":"MOD(W15,12)","v":7.8}]
[null,null,null,null,null,null,null,null,null,null,null,null,null,null,{"$f":"IF(P13=\"\",\"\",\"(4)\")","v":""},null,null,{"$f":"IF(P13=\"\",\"\",入力シート!#REF!)","v":""},"年",{"$f":"IF(P13=\"\",\"\",入力シート!#REF!)","v":""},"月"]
[null,null,null,"給料の調整額(C)",null,{"$f":"入力シート!AN74","v":0},null,null,"円",null,null,null,null,null,null,null,null,null,{"$f":"IF(O15=\"\",\"\",\"年\")","v":""},null,{"$f":"IF(O15=\"\",\"\",\"月\")","v":""},null,{"$f":"SUM(T8:T15)","v":7.8}]
{"$rows_left_out":34}
{"sheet":"【参考】調整額区分表","index":3,"n_rows":44,"n_cols":11,"rows_kept":44,"cut":false,"hidden":false,"merged":[]}
["退職手当の調整額に関する区分表"]
[]
["イ　１９年３月３１日までの適用区分"]
["区分","第１号","第２号","第３号","第４号","第５号","第６号","第７号","第８号","第９号","第１０号"]
["調整月額",78750,70400,65000,59550,54150,43350,32500,27100,21700,0]
["行政職",null,null,"１１級\n期20%","１０級\n期20%","９級\n期15%","８級\n期15%","７級\n期10%","６級\n期10%","５級・４級\n期5%","３級・２級・１級"]
["教育職(二)",null,null,null,"４級\n期20%","４級\n管16%・管14%\n期15%","４級\n期15%","３級　期10%\n２級期10%のうち注８の者","２級\n期10%","２級・１級\n期5%","２級・１級"]
["教育職(三)",null,null,null,"４級\n期20%","４級\n管16%・管14%\n期15%","４級\n期15%","３級　期10%\n２級期10%のうち注８の者","２級\n期10%","２級\n期5%","２級・１級"]
["研究職",null,null,"５級\n管25%\n期20%","５級\n期20%","４級\n管18%\n期15%","４級 期15%\n３級のうち注４の職","３級のうち注５の職","３級\n期10%","２級\n期5%","２級・１級"]
["医療職(二)\n医療職(三)",null,null,null,null,"７級\n期15%","６級\n期15%","５級のうち注６の職","５級\n期10%","４級  期5%\n３級　期5%","3級・2級・1級"]
["技能職",null,null,null,null,null,null,null,"５級\n期10%","４級  期5%\n３級　期5%\n２級　期5%","４級・３級・\n２級・１級"]
[]
["ロ　１９年４月１日から21年３月31日までの適用区分"]
["区分","第１号","第２号","第３号","第４号","第５号","第６号","第７号","第８号","第９号","第１０号"]
["調整月額",78750,70400,65000,59550,54150,43350,32500,27100,21700,0]
{"$rows_left_out":30}
{"sheet":"特に級読替表","index":4,"n_rows":67,"n_cols":23,"rows_kept":67,"cut":false,"hidden":true,"merged":[[11,23,11,24],[3,15,4,16],[3,17,4,18],[3,19,4,20],[3,21,4,22],[3,23,4,24],[7,21,7,22],[7,23,7,24],[8,23,8,24],[10,23,10,24],[8,21,8,22],[9,21,9,22],[9,23,9,24],[10,21,10,22],[11,21,11,22],[3,1,4,1],[7,1,7,2],[8,1,8,2],[36,1,36,2],[48,1,48,2],[63,1,63,2],[5,3,5,20],[17,17,18,18],[17,19,18,20],[9,1,9,2],[10,1,10,2],[28,1,28,16],[38,18,38,20],[60,14,60,20],[19,3,19,10],[38,1,38,2],[44,11,45,12],[17,1,18,1],[17,3,18,4],[17,5,18,6],[17,7,18,8],[17,15,18,16],[44,3,45,4],[44,5,45,6],[66,1,66,2],[30,1,31,1],[30,3,31,4],[30,5,31,6],[65,1,65,2],[64,1,64,2],[46,1,47,2],[49,1,49,2],[41,1,41,12],[62,1,62,2],[60,3,60,12],[60,1,61,2],[44,9,45,10],[44,7,45,8],[51,1,51,2],[55,1,55,12],[58,9,59,10],[52,1,52,2],[58,11,59,12],[58,1,59,1],[58,3,59,4],[58,5,59,6],[58,7,59,8],[44,1,45,1],[50,1,50,2],[14,1,14,10],[37,1,37,2],[21,1,21,2],[22,1,22,2],[23,1,23,2],[24,1,24,2],[30,7,31,8],[30,9,31,10],[17,9,18,10],[0,1,0,20],[14,13,14,20],[35,18,35,20],[36,18,36,20],[37,18,37,20],[34,1,34,2],[30,11,31,12],[30,13,31,14],[28,18,28,20],[17,13,18,14],[19,13,19,20],[5,1,6,2],[3,9,4,10],[3,11,4,12],[11,1,11,2],[3,13,4,14],[3,3,4,4],[3,5,4,6],[3,7,4,8],[35,1,35,2],[19,1,20,2],[32,1,33,2],[25,1,25,2],[30,18,30,20],[62,14,62,20],[63,14,63,20],[64,14,64,20],[65,14,65,20],[41,13,41,21],[31,18,31,20],[32,18,32,20],[33,18,33,20],[34,18,34,20],[30,15,31,16],[61,14,61,20],[48,14,48,20]]}
[null,"行　政　職　給　料　表"]
[]
[]
[null,null,"職務","１　級",null," ２　級",null,"３　級",null,"４　級",null,"５　級",null,"６　級",null,"７　級",null,"８　級",null,"９　級"]
[null,null,"の級"]
[null,"特　に",null,"読　替　号　俸"]
[null,null,null,null,"号俸",null,"号俸",null,"号俸",null,"号俸",null,"号俸",null,"号俸",null,"号俸",null,"号俸",null,"号俸"]
[null,"特(1)",null,189000,17,245400,20,317400,33,364700,29,382200,27,417900,25,428400,23,452300,22,488400,19]
[null,"特(2)",null,190600,{"$f":"E8+1","v":18},247200,{"$f":"G8+1","v":21},319200,{"$f":"I8+1","v":34},366900,{"$f":"K8+1","v":30},384800,{"$f":"M8+1","v":28},421300,{"$f":"O8+1","v":26},431900,{"$f":"Q8+1","v":24},455900,{"$f":"S8+1","v":23},492500,{"$f":"U8+1","v":20}]
[null,"特(3)",null,192200,{"$f":"E9+1","v":19},249000,{"$f":"G9+1","v":22},321000,{"$f":"I9+1","v":35},369100,{"$f":"K9+1","v":31},387400,{"$f":"M9+1","v":29},424700,{"$f":"O9+1","v":27},435400,{"$f":"Q9+1","v":25},459500,{"$f":"S9+1","v":24},496600,{"$f":"U9+1","v":21}]
[null,"特(4)",null,193800,{"$f":"E10+1","v":20},250800,{"$f":"G10+1","v":23},322800,{"$f":"I10+1","v":36},371300,{"$f":"K10+1","v":32},390000,{"$f":"M10+1","v":30},428100,{"$f":"O10+1","v":28},438900,{"$f":"Q10+1","v":26},463100,{"$f":"S10+1","v":25},500700,{"$f":"U10+1","v":22}]
[null,"特(5)",null,195400,{"$f":"E11+1","v":21},252600,{"$f":"G11+1","v":24},324600,{"$f":"I11+1","v":37},373500,{"$f":"K11+1","v":33},392600,{"$f":"M11+1","v":31},431500,{"$f":"O11+1","v":29},442400,{"$f":"Q11+1","v":27},466700,{"$f":"S11+1","v":26},504800,{"$f":"U11+1","v":23}]
[]
[]
[null,"教　育　職　給　料　表（二）県立",null,null,null,null,null,null,null,null,null,null,null,"教　育　職　給　料　表（三）小中"]
{"$rows_left_out":53}
{"sheet":"給料表計算シート","index":5,"n_rows":25,"n_cols":7,"rows_kept":25,"cut":false,"hidden":true,"merged":[[11,2,11,3],[20,2,20,3]]}
["１　現在の給料表"]
[]
[null,null,null,null,"給料表","調整額"]
["行政",{"$f":"IF(入力シート!$B$65=\"行政\",入力シート!$B$65,\"\")","v":""},{"$f":"IF(B4=\"\",\"\",入力シート!$U$65)","v":""},{"$f":"IF(B4=\"\",\"\",入力シート!$AC$65)","v":""},{"$f":"IF(B4=\"\",\"\",VLOOKUP($D$16,給料表!$B$2:$C$3550,2,0))","v":""},{"$f":"IF(B4=\"\",\"\",VLOOKUP($D$17,給料表!$F$2:$G$3550,2,0))","v":""},{"$f":"IF(B4=\"\",\"\",1)","v":""}]
["教育（一）",{"$f":"IF(入力シート!$B$65=\"教育（一）\",入力シート!$B$65,\"\")","v":""},{"$f":"IF(B5=\"\",\"\",入力シート!$U$65)","v":""},{"$f":"IF(B5=\"\",\"\",入力シート!$AC$65)","v":""},{"$f":"IF(B5=\"\",\"\",VLOOKUP($D$16,給料表!$B$2:$C$3550,2,0))","v":""},{"$f":"IF(B5=\"\",\"\",VLOOKUP($D$17,給料表!$F$2:$G$3550,2,0))","v":""},{"$f":"IF(B5=\"\",\"\",4)","v":""}]
["教育（二）",{"$f":"IF(入力シート!$B$65=\"教育（二）\",入力シート!$B$65,\"\")","v":"教育（二）"},{"$f":"IF(B6=\"\",\"\",入力シート!$U$65)","v":3},{"$f":"IF(B6=\"\",\"\",入力シート!$AC$65)","v":50},{"$f":"IF(B6=\"\",\"\",VLOOKUP($D$16,給料表!$B$2:$C$3550,2,0))","v":392000},{"$f":"IF(B6=\"\",\"\",VLOOKUP($D$17,給料表!$F$2:$G$3550,2,0))","v":12000},{"$f":"IF(B6=\"\",\"\",5)","v":5}]
["研究",{"$f":"IF(入力シート!$B$65=\"研究\",入力シート!$B$65,\"\")","v":""},{"$f":"IF(B7=\"\",\"\",入力シート!$U$65)","v":""},{"$f":"IF(B7=\"\",\"\",入力シート!$AC$65)","v":""},{"$f":"IF(B7=\"\",\"\",VLOOKUP($D$16,給料表!$B$2:$C$3550,2,0))","v":""},{"$f":"IF(B7=\"\",\"\",VLOOKUP($D$17,給料表!$F$2:$G$3550,2,0))","v":""},{"$f":"IF(B7=\"\",\"\",6)","v":""}]
["技能",{"$f":"IF(入力シート!$B$65=\"技能\",入力シート!$B$65,\"\")","v":""},{"$f":"IF(B8=\"\",\"\",入力シート!$U$65)","v":""},{"$f":"IF(B8=\"\",\"\",入力シート!$AC$65)","v":""},{"$f":"IF(B8=\"\",\"\",VLOOKUP($D$16,給料表!$B$2:$C$3550,2,0))","v":""},{"$f":"IF(B8=\"\",\"\",VLOOKUP($D$17,給料表!$F$2:$G$3550,2,0))","v":""},{"$f":"IF(B8=\"\",\"\",10)","v":""}]
["医療（二）",{"$f":"IF(入力シート!$B$65=\"医療（二）\",入力シート!$B$65,\"\")","v":""},{"$f":"IF(B9=\"\",\"\",入力シート!$U$65)","v":""},{"$f":"IF(B9=\"\",\"\",入力シート!$AC$65)","v":""},{"$f":"IF(B9=\"\",\"\",VLOOKUP($D$16,給料表!$B$2:$C$3550,2,0))","v":""},{"$f":"IF(B9=\"\",\"\",VLOOKUP($D$17,給料表!$F$2:$G$3550,2,0))","v":""},{"$f":"IF(B9=\"\",\"\",8)","v":""}]
["医療（三）",{"$f":"IF(入力シート!$B$65=\"医療（三）\",入力シート!$B$65,\"\")","v":""},{"$f":"IF(B10=\"\",\"\",入力シート!$U$65)","v":""},{"$f":"IF(B10=\"\",\"\",入力シート!$AC$65)","v":""},{"$f":"IF(B10=\"\",\"\",VLOOKUP($D$16,給料表!$B$2:$C$3550,2,0))","v":""},{"$f":"IF(B10=\"\",\"\",VLOOKUP($D$17,給料表!$F$2:$G$3550,2,0))","v":""},{"$f":"IF(B10=\"\",\"\",9)","v":""}]
[]
[null,null,"給料月額",null,{"$f":"MAX(E4:E10)","v":392000},{"$f":"MAX(F4:F10)","v":12000}]
[null,"給与表コード","級","号俸"]
[null,{"$f":"SUM(G4:G10)","v":5},{"$f":"SUM(C4:C10)","v":3},{"$f":"SUM(D4:D10)","v":50}]
[]
{"$rows_left_out":11}
{"sheet":"給料表","index":6,"n_rows":3550,"n_cols":7,"rows_kept":3550,"cut":false,"hidden":true,"merged":[]}
["2023-04-01","表級号","金額",null,"調整額","表級","金額"]
["給料表",101001,163200,null,"給料表",101,6700]
[null,101002,164300,null,null,102,8600]
[null,101003,165500,null,null,103,9800]
[null,101004,166600,null,null,104,10500]
[null,101005,167700,null,null,105,10800]
[null,101006,168900,null,null,106,11400]
[null,101007,170000,null,null,107,12300]
[null,101008,171000,null,null,108,13000]
[null,101009,172000,null,null,109,14700]
[null,101010,173400,null,null,110,16300]
[null,101011,174700,null,null,401,9100]
[null,101012,176000,null,null,402,11300]
[null,101013,177300,null,null,425,11700]
[null,101014,178800,null,null,403,12400]
{"$rows_left_out":3536}
{"sheet":"計算シート","index":7,"n_rows":44,"n_cols":14,"rows_kept":44,"cut":false,"hidden":true,"merged":[[39,3,39,9],[48,3,48,14],[41,0,41,6],[23,3,23,9],[15,3,15,14],[17,3,17,15],[19,3,19,14]]}
["条例改正に伴う退職手当額試算シート",null,null,null,null,null,null,null,null,null,"ver3.0"]
[null,null,null,null,null,null,null,null,null,null,null,null,"自己都合"]
["１．H３０.３.３１に退職した場合",null,null,null,null,null,null,null,null,null,null,null,"定年・勧奨"]
[]
[null,null,null,"年齢(H30.3.31)",null,"※１勤続年数",null,"※２給料月額(現在)",null,null,{"$f":"MAX(H6:H9)","v":399500},{"$f":"IF(入力シート!#REF!=0,1251000,入力シート!#REF!)","v":{"$error":"#REF!"}}]
[null,null,null,{"$f":"入力シート!#REF!","v":{"$error":"#REF!"}},null,{"$f":"入力シート!AW43","v":34},null,{"$f":"入力シート!BG74","v":399500},null,"新条例",{"$f":"IF(F9=1,VLOOKUP($F$6,'H30.4.1'!A5:C50,3,FALSE),VLOOKUP($F$6,'H30.4.1'!A5:C50,2,FALSE))","v":46.830150000000003},{"$f":"SUM(K5*K6)+L5","v":{"$error":"#REF!"}}]
[]
[null,null,null,"退職区分",null,null,null,"退職手当上の給料月額"]
[null,null,null,{"$f":"入力シート!B13","v":"定年扱い"},null,{"$f":"IF(D9=\"自己都合\",1,2)","v":2},null,{"$f":"IF(AND($D$9=\"定年\",F6>24),H6*VLOOKUP(D6,#REF!,2,FALSE),H6)","v":399500}]
[]
[]
[]
[null,null,null,"給料月額",null,"支給割合",null,"調整額",null,"退職手当額"]
[null,null,null,{"$f":"H6","v":399500},"×",{"$f":"K6","v":46.830150000000003},"＋",{"$f":"入力シート!$BD$127+入力シート!$BD$143","v":1690800},"＝",{"$f":"INT(D14*F14)+H14","v":20399444}]
[]
{"$rows_left_out":30}
{"sheet":"Sheet1","index":8,"n_rows":36,"n_cols":4,"rows_kept":36,"cut":false,"hidden":true,"merged":[[33,1,34,2],[33,3,34,11],[35,1,37,2],[35,3,37,11],[8,1,8,9],[29,3,32,11],[29,1,32,2]]}
[]
[null,"行政職給料表が適用されている者"]
[null,"　退職時前５年間の号俸を確認してください。"]
[null,"　例１）退職時前５年間　２級　である。"]
[null,"　　　　第10号区分に　６０月　と入力します。"]
[null,"　例２）退職時より３年前に４級に昇給し、それ以前は３級であった。"]
[null,"　　　　第9号区分に　２４月（２年間）、第8号区分に　３６月（３年間）と入力します。"]
[]
[null,"教職職給料表(一)(二)が適用されている者"]
[null,"　校長職にある者・・・第５号区分に　６０月　と入力"]
[null,"　副校長職にある者・・・第６号区分に　６０月　と入力"]
[null,"　教頭職にある者・・・第７号区分に　６０月　と入力"]
[null,"　特２級の者・・・第８号区分に　６０月　と入力"]
[null,"　２級の者のうち，勤続期間が１０年以上２６年未満の者・・・第９号区分に　６０月　と入力"]
[null,"　２級の者のうち，勤続期間が２６年以上３５年未満の者・・・第８号区分に　６０月　と入力"]
{"$rows_left_out":22}
{"sheet":"Sheet2","index":9,"n_rows":21,"n_cols":11,"rows_kept":21,"cut":false,"hidden":true,"merged":[]}
["次年度　調整額計算"]
[]
[null,"前年度a"]
[null,null,"4号","５号","６号","7号","8号","9号","10号","合計"]
[null,null,{"$f":"入力シート!#REF!","v":{"$error":"#REF!"}},{"$f":"入力シート!#REF!","v":{"$error":"#REF!"}},{"$f":"入力シート!#REF!","v":{"$error":"#REF!"}},{"$f":"入力シート!#REF!","v":{"$error":"#REF!"}},{"$f":"入力シート!#REF!","v":{"$error":"#REF!"}},{"$f":"入力シート!#REF!","v":{"$error":"#REF!"}},{"$f":"入力シート!#REF!","v":{"$error":"#REF!"}},{"$f":"SUM(C5:I5)","v":{"$error":"#REF!"}},{"$f":"IF(J5<60,J5+12,J5)","v":{"$error":"#REF!"}}]
[null,"a＋12",{"$f":"IF(C5>0,C5+12,C5)","v":{"$error":"#REF!"}},{"$f":"IF(D5>0,D5+12,D5)","v":{"$error":"#REF!"}},{"$f":"IF(AND(D5=0,E5>0),E5+12,E5)","v":{"$error":"#REF!"}},{"$f":"IF(AND(E5=0,F5>0),F5+12,F5)","v":{"$error":"#REF!"}},{"$f":"IF(AND(F5=0,G5>0),G5+12,G5)","v":{"$error":"#REF!"}},{"$f":"IF(AND(G5=0,H5>0),H5+12,H5)","v":{"$error":"#REF!"}},{"$f":"IF(AND(H5=0,I5>0),I5+12,I5)","v":{"$error":"#REF!"}}]
[null,null,{"$f":"IF(C6>60,60,C6)","v":{"$error":"#REF!"}},{"$error":"#REF!"},{"$error":"#REF!"},{"$error":"#REF!"},{"$error":"#REF!"},{"$error":"#REF!"},{"$error":"#REF!"}]
[null,"a-12",{"$f":"C5-12","v":{"$error":"#REF!"}},{"$error":"#REF!"},{"$error":"#REF!"},{"$error":"#REF!"},{"$error":"#REF!"},{"$error":"#REF!"},{"$error":"#REF!"}]
[null,null,1,2,3,4,5,6,7]
[null,1,{"$f":"$C$7","v":{"$error":"#REF!"}},{"$f":"IF(AND(C5=0),$D$7,D5)","v":{"$error":"#REF!"}},{"$f":"IF(AND(C5=0,D5=0),$E$7,E5)","v":{"$error":"#REF!"}},{"$f":"IF(AND(C5=0,D5=0,E5=0),$F$7,F5)","v":{"$error":"#REF!"}},{"$f":"IF(AND(D5=0,E5=0,F5=0,C5=0),$G$7,G5)","v":{"$error":"#REF!"}},{"$f":"IF(AND(C5=0,E5=0,F5=0,G5=0,D5=0),$H$7,H5)","v":{"$error":"#REF!"}},{"$f":"IF(I$8<0,I$6-I$6,I$6-12)","v":{"$error":"#REF!"}},{"$f":"SUM(C10:I10)","v":{"$error":"#REF!"}},1]
[null,2,{"$error":"#REF!"},{"$f":"D10","v":{"$error":"#REF!"}},{"$f":"E10","v":{"$error":"#REF!"}},{"$f":"F10","v":{"$error":"#REF!"}},{"$f":"$G$7","v":{"$error":"#REF!"}},{"$f":"IF(H$8<0,0,H$5-12)","v":{"$error":"#REF!"}},0,{"$error":"#REF!"},2]
[null,3,{"$error":"#REF!"},{"$f":"D11","v":{"$error":"#REF!"}},{"$f":"E10","v":{"$error":"#REF!"}},{"$f":"F10","v":{"$error":"#REF!"}},{"$f":"IF(G$8<0,0,IF(OR(H5>0,I5>0,J5>0),60-D5-E5-F5-C5,G6))","v":{"$error":"#REF!"}},0,0,{"$error":"#REF!"},3]
[null,4,{"$error":"#REF!"},{"$f":"D12","v":{"$error":"#REF!"}},{"$f":"E10","v":{"$error":"#REF!"}},{"$f":"IF(F$8<0,0,IF(OR(G5>0,H5>0,I5>0),60-C6-D6-E6,F8))","v":{"$error":"#REF!"}},0,0,0,{"$error":"#REF!"},4]
[null,5,{"$error":"#REF!"},{"$f":"D13","v":{"$error":"#REF!"}},{"$f":"IF(E$8<0,0,IF(OR(F5>0,G5>0,H5>0,I4>0),60-C6-D6,E8))","v":{"$error":"#REF!"}},0,0,0,0,{"$error":"#REF!"},5]
[null,6,{"$error":"#REF!"},{"$f":"IF(D$6<0,0,IF(OR(E5>0,F5>0,G4>0,H5>0),60-C6,D8))","v":{"$error":"#REF!"}},0,0,0,0,0,{"$error":"#REF!"},6]
{"$rows_left_out":7}
{"sheet":"Sheet3","index":10,"n_rows":22,"n_cols":13,"rows_kept":22,"cut":false,"hidden":true,"merged":[[19,4,19,13],[21,4,21,13],[15,11,15,13],[19,1,19,2],[21,1,21,2],[17,1,17,2],[14,1,14,3],[14,5,14,7],[14,9,14,10],[14,12,14,13],[17,4,17,13]]}
[]
[]
[]
[]
[]
[]
[]
[]
[]
[]
[]
[]
[]
[]
["※","退職手当の給料月額",null,null,"＝","本俸（給料表の月額）",null,null,"＋","教職調整額",null,"＋","給料の調整額"]
{"$rows_left_out":8}
{"sheet":"除算","index":11,"n_rows":11,"n_cols":7,"rows_kept":11,"cut":false,"hidden":true,"merged":[]}
[null,"除算１",null,null,null,"除算２"]
[]
[null,"休職",2,null,null,"休職",2]
[null,"停職",2,null,null,"停職",2]
[null,"大学院修学",2,null,null,"大学院修学",2]
[null,"育休",3,null,null,"育休",2]
[null,"育短勤務",3,null,null,"育短勤務",3]
[null,"高齢者部分休業",2,null,null,"高齢者部分休業",2]
[null,"組合専従",1,null,null,"組合専従",1]
[null,"自己啓発",1,null,null,"自己啓発",1]
[null,"配偶者同行休業",1,null,null,"配偶者同行休業",1]

{"sheet":"H30.4.1","index":12,"n_rows":50,"n_cols":8,"rows_kept":50,"cut":false,"hidden":true,"merged":[]}
[null,null,null,null,null,"新支給率"]
[null,null,null,"新"]
[null,"勧奨","自己都合",null,null,null,"1985-03-31",{"$f":"DATEVALUE(G3)","v":{"$error":"#VALUE!"}}]
[" 年  数"]
[0,null,0]
[1,0.83700000000000008,0.50219999999999998]
[2,1.6740000000000002,1.0044]
[3,2.5110000000000001,1.5065999999999999]
[4,3.3480000000000003,2.0087999999999999]
[5,4.1849999999999996,2.5110000000000001]
[6,5.0220000000000002,3.0131999999999999]
[7,5.859,3.5154000000000001]
[8,6.6960000000000006,4.0175999999999998]
[9,7.5330000000000004,4.5198]
[10,8.3699999999999992,5.0220000000000002]
{"$rows_left_out":36}
{"sheet":"育休特殊事例入力方法","index":13,"n_rows":40,"n_cols":3,"rows_kept":40,"cut":false,"hidden":true,"merged":[[7,1,7,9],[0,1,1,9],[3,1,3,9],[4,1,4,9],[5,1,5,9],[6,1,6,9],[23,1,23,9],[36,2,36,9],[37,2,37,9],[39,1,41,9],[8,1,8,9],[24,1,24,9],[15,1,15,9],[16,1,16,9],[20,2,20,9],[21,2,21,9],[9,1,9,9],[10,1,10,9],[11,1,11,9],[12,1,12,9],[13,1,13,9],[14,1,14,9]]}
[null,"育児休業から復帰後、再度、同一の子の育児休業を取得した場合について"]
[]
[]
[null,"　入力シートの除算期間の子の誕生日欄は、行毎に子の誕生日が異なることを想定していますので、"]
[null,"期間を空けて同じ子の育児休業を取得した場合は、正しく計算されない事があります。"]
[null,"その場合は、お手数をおかけしますが下記のとおり入力してください。"]
[]
[null,"①子どもの１歳の誕生日を越えて、１回目の育児休業を取得した場合"]
[null,"※１歳の誕生日：H23.5.26"]
[]
[]
[]
[]
[]
[]
{"$rows_left_out":25}