{"text_format":"1","workbook":"xlsx","n_sheets":8,"sheets":["(はじめにお読み下さい)報告書作成手順","実績報告書","個票1","個票2","職員表","実績額一覧","法人実績額内訳","計算用"],"not_rendered":{"charts":0,"images":0,"macros":1,"external_links":0,"defined_names":10,"comments":5,"pivot_tables":0},"unopened":[],"bounds":{"document_bytes":16777216,"sheet_cells":100000,"rows_first":2000,"rows_last":500,"rows_between":2000,"halvings":0,"cell_chars":16384,"cell_head_chars":4096},"cells_cut":0,"cells_raw":0,"read":"whole","date_system":"1900"}

{"sheet":"(はじめにお読み下さい)報告書作成手順","index":0,"n_rows":14,"n_cols":3,"rows_kept":14,"cut":false,"hidden":false,"merged":[[1,0,1,2]]}
[]
["本報告書の作成手順"]
[]
["手順","法人本部の作業","各事業所の作業"]
[1,null,"証憑書類を各補助事業ごとに整理（表紙＋領収証等の写し）\n※整理方法については，別紙マニュアルP.6～7参照"]
[{"$f":"A5+1","v":2},"【実績報告書】へ宮城県から受け取った交付決定通知書に記載されている日付と指令番号を入力（紫色のセルに入力）\n※１件の交付決定に対して１件の実績報告書を作成していただくことになります。複数回交付申請を行い，複数の交付決定を受けている法人は，それぞれの交付決定に対して，実績報告書を作成してください。\n※交付決定日や指令番号が不明な場合は，申請法人名・申請時期を明記の上，「covid-jisseki@pref.miyagi.lg.jp」までメールにてお問い合わせください。"]
[{"$f":"A6+1","v":3},"各事業所へ【個票●】及び【職員表】への情報入力，証憑書類の提出を依頼\n※個票及び職員表へ入力を依頼する情報及び証憑書類は，上記で入力した交付決定通知分となりますので，交付申請の際と同じ事業所を取りまとめてください。"]
[4,null,"以下の作業を行った上で，法人本部へ証憑書類とともに送付\n【個票●】\n・水色セル：必要情報を入力\n・緑色セル：プルダウンから選択\n【職員表】\n・慰労金を受領した職員について，氏名や支払年月日などの情報を職員表に取りまとめ(水色セル：必要情報を入力，緑色セル：プルダウンから選択)"]
[5,"各事業所の【個票】のシートを１つのExcelファイルに集約し，個票シート名を【個票●】（●は１からの通し番号）に修正"]
[6,"各事業所の【職員表】を法人単位で一覧表として取りまとめ\n※氏名（漢字、カナ），生年月日が一致する者がいる場合，「重複受給者確認用」欄に「可」と表示されません。\n※記入欄が不足する場合は，6行目～205行目を行ごとコピーし，206行目に右クリック→「コピーしたセルの挿入」で挿入。"]
{"$rows_left_out":5}
{"sheet":"実績報告書","index":1,"n_rows":43,"n_cols":62,"rows_kept":43,"cut":false,"hidden":false,"merged":[[6,22,6,36],[19,59,19,60],[20,59,20,60],[12,1,12,2],[19,47,19,48],[19,53,19,54],[20,47,20,48],[20,53,20,54],[12,8,12,19],[7,35,8,36],[7,22,7,34],[2,35,2,36],[2,32,2,33],[2,29,2,30],[20,2,20,22],[21,2,21,22],[18,2,18,22],[18,23,18,27],[19,23,19,27],[20,23,20,27],[21,23,21,27],[13,0,13,38],[10,0,10,38],[15,1,15,9],[15,10,15,17],[19,2,19,22],[8,22,8,34],[42,28,42,36],[41,20,42,22],[41,24,41,27],[42,24,42,27],[41,28,41,36],[39,20,39,26],[40,20,40,26],[39,28,39,36],[40,28,40,36],[12,20,12,21],[38,28,38,36],[37,28,37,36],[37,20,38,23],[37,24,37,27],[38,24,38,27]]}
[]
[]
[null,null,null,null,null,null,null,null,null,null,null,null,null,null,null,null,null,null,null,null,null,null,null,null,null,null,null,null,"　　令和",2,null,"年",12,null,"月",13,null,"日"]
[]
["宮城県知事　村井　嘉浩　殿"]
[]
[null,null,null,null,null,null,null,null,null,null,null,null,null,null,null,null,null,null,null,null,null,"（法人住所）","仙台市青葉区本町３丁目８－１"]
[null,null,null,null,null,null,null,null,null,null,null,null,null,null,null,null,null,null,null,null,null,"（法人名）","社会福祉法人宮城県",null,null,null,null,null,null,null,null,null,null,null,null,"印"]
[null,null,null,null,null,null,null,null,null,null,null,null,null,null,null,null,null,null,null,null,null,"（役職・代表者名）","理事長　宮城　太郎"]
[]
{"$rows_left_out":34}
{"sheet":"個票1","index":2,"n_rows":59,"n_cols":84,"rows_kept":59,"cut":false,"hidden":false,"merged":[[46,37,47,38],[46,32,47,36],[46,28,47,31],[20,23,20,27],[35,28,35,31],[35,32,35,36],[33,12,33,38],[25,12,25,38],[26,12,26,38],[27,12,27,38],[21,28,22,31],[21,32,22,36],[21,37,22,38],[36,28,37,31],[36,32,37,36],[46,26,47,27],[45,23,45,27],[40,37,40,38],[41,37,41,38],[42,37,42,38],[41,23,41,25],[42,23,42,25],[38,26,38,27],[43,23,43,25],[41,26,41,27],[41,28,41,33],[41,34,41,36],[38,23,38,25],[39,37,39,38],[45,28,45,31],[45,37,45,38],[45,32,45,36],[43,34,43,36],[43,37,43,38],[38,37,38,38],[58,7,58,11],[58,12,58,38],[57,7,57,11],[48,12,48,38],[49,12,49,38],[50,12,50,38],[51,12,51,38],[52,12,52,38],[57,12,57,38],[53,7,53,11],[53,12,53,38],[54,7,54,11],[54,12,54,38],[55,7,55,11],[55,12,55,38],[56,7,56,11],[56,12,56,38],[48,0,48,6],[48,7,48,11],[49,7,49,11],[50,7,50,11],[51,7,51,11],[52,7,52,11],[38,28,38,33],[38,34,38,36],[40,34,40,36],[43,26,43,27],[40,26,40,27],[40,28,40,33],[42,26,42,27],[42,28,42,33],[42,34,42,36],[40,23,40,25],[43,28,43,33],[38,0,39,9],[39,23,39,25],[39,26,39,27],[39,28,39,33],[39,34,39,36],[40,1,43,9],[46,23,47,25],[9,0,9,6],[7,11,7,24],[8,11,8,24],[9,41,9,46],[18,7,18,11],[18,12,18,14],[18,16,18,20],[18,21,18,23],[9,25,9,27],[9,28,9,29],[9,30,9,31],[10,0,11,7],[15,37,15,38],[9,7,9,24],[16,37,17,38],[16,32,17,36],[16,28,17,31],[13,0,13,38],[9,32,9,38],[2,0,2,38],[4,0,4,38],[6,14,6,18],[7,0,8,2],[7,7,7,10],[8,7,8,10],[7,25,8,27],[6,7,6,13],[6,19,6,38],[6,0,6,6],[8,28,8,32],[7,28,7,32],[8,3,8,6],[7,3,7,6],[7,33,7,38],[8,33,8,38],[23,0,23,6],[24,12,24,38],[23,12,23,38],[24,7,24,11],[23,7,23,11],[18,30,18,32],[15,28,15,31],[15,32,15,36],[20,32,20,36],[20,37,20,38],[20,28,20,31],[21,23,22,25],[21,26,22,27],[29,12,29,38],[30,12,30,38],[31,12,31,38],[32,7,32,11],[32,12,32,38],[36,37,37,38],[25,7,25,11],[26,7,26,11],[27,7,27,11],[35,37,35,38],[33,7,33,11],[28,7,28,11],[29,7,29,11],[31,7,31,11],[30,7,30,11],[28,12,28,38]]}
[]
[]
["新型コロナウイルス感染症緊急包括支援交付金（介護分）に関する事業実績報告書（事業所単位）",null,null,null,null,null,null,null,null,null,null,null,null,null,null,null,null,null,null,null,null,null,null,null,null,null,null,null,null,null,null,null,null,null,null,null,null,null,null,null,null,null,null,null,null,null,null,null,null,null,null,null,null,null,null,null,null,null,null,null,null,null,null,null,null,null,null,null,null,null,null,null,null,null,null,null,null,null,null,"（１）①　",null,null,"（２）②"]
[null,null,null,null,null,null,null,null,null,null,null,null,null,null,null,null,null,null,null,null,null,null,null,null,null,null,null,null,null,null,null,null,null,null,null,null,null,null,null,null,null,null,null,null,null,null,null,null,null,null,null,null,null,null,null,null,null,null,null,null,null,null,null,null,null,null,null,null,null,null,null,null,null,null,null,null,null,null,null,"共通",null,"単価","共通"]
["施設概要",null,null,null,null,null,null,null,null,null,null,null,null,null,null,null,null,null,null,null,null,null,null,null,null,null,null,null,null,null,null,null,null,null,null,null,null,null,null,null,null,null,null,null,null,null,null,null,null,null,null,null,null,null,null,null,null,null,null,null,null,null,null,null,null,null,null,null,null,null,null,null,null,null,null,null,null,null,"通所介護事業所（通常規模型）",892,"/事業所",null,200,"/事業所"]
[null,null,null,null,null,null,null,null,null,null,null,null,null,null,null,null,null,null,null,null,null,null,null,null,null,null,null,null,null,null,null,null,null,null,null,null,null,null,null,null,null,null,null,null,null,null,null,null,null,null,null,null,null,null,null,null,null,null,null,null,null,null,null,null,null,null,null,null,null,null,null,null,null,null,null,null,null,null,"通所介護事業所（大規模型（Ⅰ））",1137,"/事業所",null,200,"/事業所"]
["介護保険事業所番号",null,null,null,null,null,null,"0420123456",null,null,null,null,null,null,"事業所名称",null,null,null,null,"特別養護老人ホーム長寿社会政策課",null,null,null,null,null,null,null,null,null,null,null,null,null,null,null,null,null,null,null,null,null,null,null,null,null,null,null,null,null,null,null,null,null,null,null,null,null,null,null,null,null,null,null,null,null,null,null,null,null,null,null,null,null,null,null,null,null,null,"通所介護事業所（大規模型（Ⅱ））",1480,"/事業所",null,200,"/事業所"]
["所在地",null,null,"郵便番号",null,null,null,"都道府県名",null,null,null,"住所",null,null,null,null,null,null,null,null,null,null,null,null,null,"連絡先",null,null,"電話番号",null,null,null,null,"担当部署名",null,null,null,null,null,null,null,null,null,null,null,null,null,null,null,null,null,null,null,null,null,null,null,null,null,null,null,null,null,null,null,null,null,null,null,null,null,null,null,null,null,null,null,null,"地域密着型通所介護事業所(療養通所介護事業所を含む)",384,"/事業所",null,200,"/事業所"]
[null,null,null,"980-8570",null,null,null,"宮城県",null,null,null,"仙台市青葉区本町３丁目８－１",null,null,null,null,null,null,null,null,null,null,null,null,null,null,null,null,"022-211-2549",null,null,null,null,"施設支援班",null,null,null,null,null,null,null,null,null,null,null,null,null,null,null,null,null,null,null,null,null,null,null,null,null,null,null,null,null,null,null,null,null,null,null,null,null,null,null,null,null,null,null,null,"認知症対応型通所介護事業所",375,"/事業所",null,200,"/事業所"]
["提供サービス",null,null,null,null,null,null,"介護老人福祉施設",null,null,null,null,null,null,null,null,null,null,null,null,null,null,null,null,null,"定員",null,null,40,null,"人",null,null,null,null,null,null,null,null,null,null,null,null,null,null,null,null,null,null,null,null,null,null,null,null,null,null,null,null,null,null,null,null,null,null,null,null,null,null,null,null,null,null,null,null,null,null,null,"通所リハビリテーション事業所（通常規模型）",939,"/事業所",null,200,"/事業所"]
{"$rows_left_out":50}
{"sheet":"個票2","index":3,"n_rows":59,"n_cols":84,"rows_kept":59,"cut":false,"hidden":false,"merged":[[58,7,58,11],[58,12,58,38],[55,7,55,11],[55,12,55,38],[56,7,56,11],[56,12,56,38],[57,7,57,11],[57,12,57,38],[52,7,52,11],[52,12,52,38],[53,7,53,11],[53,12,53,38],[54,7,54,11],[54,12,54,38],[49,7,49,11],[49,12,49,38],[50,7,50,11],[50,12,50,38],[51,7,51,11],[51,12,51,38],[46,23,47,25],[46,26,47,27],[46,28,47,31],[46,32,47,36],[46,37,47,38],[48,0,48,6],[48,7,48,11],[48,12,48,38],[43,23,43,25],[43,26,43,27],[43,28,43,33],[43,34,43,36],[43,37,43,38],[45,23,45,27],[45,28,45,31],[45,32,45,36],[45,37,45,38],[40,1,43,9],[40,23,40,25],[40,26,40,27],[40,28,40,33],[40,34,40,36],[40,37,40,38],[41,23,41,25],[41,26,41,27],[41,28,41,33],[41,34,41,36],[41,37,41,38],[42,23,42,25],[42,26,42,27],[42,28,42,33],[42,34,42,36],[42,37,42,38],[36,28,37,31],[36,32,37,36],[36,37,37,38],[38,0,39,9],[38,23,38,25],[38,26,38,27],[38,28,38,33],[38,34,38,36],[38,37,38,38],[39,23,39,25],[39,26,39,27],[39,28,39,33],[39,34,39,36],[39,37,39,38],[32,7,32,11],[32,12,32,38],[33,7,33,11],[33,12,33,38],[35,28,35,31],[35,32,35,36],[35,37,35,38],[29,7,29,11],[29,12,29,38],[30,7,30,11],[30,12,30,38],[31,7,31,11],[31,12,31,38],[26,7,26,11],[26,12,26,38],[27,7,27,11],[27,12,27,38],[28,7,28,11],[28,12,28,38],[23,0,23,6],[23,7,23,11],[23,12,23,38],[24,7,24,11],[24,12,24,38],[25,7,25,11],[25,12,25,38],[20,23,20,27],[20,28,20,31],[20,32,20,36],[20,37,20,38],[21,23,22,25],[21,26,22,27],[21,28,22,31],[21,32,22,36],[21,37,22,38],[16,28,17,31],[16,32,17,36],[16,37,17,38],[18,7,18,11],[18,12,18,14],[18,16,18,20],[18,21,18,23],[18,30,18,32],[9,32,9,38],[9,41,9,46],[10,0,11,7],[13,0,13,38],[15,28,15,31],[15,32,15,36],[15,37,15,38],[9,0,9,6],[9,7,9,24],[9,25,9,27],[9,28,9,29],[9,30,9,31],[2,0,2,38],[4,0,4,38],[6,0,6,6],[6,7,6,13],[6,14,6,18],[6,19,6,38],[7,33,7,38],[8,3,8,6],[8,7,8,10],[8,11,8,24],[8,28,8,32],[8,33,8,38],[7,0,8,2],[7,3,7,6],[7,7,7,10],[7,11,7,24],[7,25,8,27],[7,28,7,32]]}
[]
[]
["新型コロナウイルス感染症緊急包括支援交付金（介護分）に関する事業実績報告書（事業所単位）",null,null,null,null,null,null,null,null,null,null,null,null,null,null,null,null,null,null,null,null,null,null,null,null,null,null,null,null,null,null,null,null,null,null,null,null,null,null,null,null,null,null,null,null,null,null,null,null,null,null,null,null,null,null,null,null,null,null,null,null,null,null,null,null,null,null,null,null,null,null,null,null,null,null,null,null,null,null,"（１）①　",null,null,"（２）②"]
[null,null,null,null,null,null,null,null,null,null,null,null,null,null,null,null,null,null,null,null,null,null,null,null,null,null,null,null,null,null,null,null,null,null,null,null,null,null,null,null,null,null,null,null,null,null,null,null,null,null,null,null,null,null,null,null,null,null,null,null,null,null,null,null,null,null,null,null,null,null,null,null,null,null,null,null,null,null,null,"共通",null,"単価","共通"]
["施設概要",null,null,null,null,null,null,null,null,null,null,null,null,null,null,null,null,null,null,null,null,null,null,null,null,null,null,null,null,null,null,null,null,null,null,null,null,null,null,null,null,null,null,null,null,null,null,null,null,null,null,null,null,null,null,null,null,null,null,null,null,null,null,null,null,null,null,null,null,null,null,null,null,null,null,null,null,null,"通所介護事業所（通常規模型）",892,"/事業所",null,200,"/事業所"]
[null,null,null,null,null,null,null,null,null,null,null,null,null,null,null,null,null,null,null,null,null,null,null,null,null,null,null,null,null,null,null,null,null,null,null,null,null,null,null,null,null,null,null,null,null,null,null,null,null,null,null,null,null,null,null,null,null,null,null,null,null,null,null,null,null,null,null,null,null,null,null,null,null,null,null,null,null,null,"通所介護事業所（大規模型（Ⅰ））",1137,"/事業所",null,200,"/事業所"]
["介護保険事業所番号",null,null,null,null,null,null,"0420123999",null,null,null,null,null,null,"事業所名称",null,null,null,null,"居宅介護支援事業所長寿社会政策課",null,null,null,null,null,null,null,null,null,null,null,null,null,null,null,null,null,null,null,null,null,null,null,null,null,null,null,null,null,null,null,null,null,null,null,null,null,null,null,null,null,null,null,null,null,null,null,null,null,null,null,null,null,null,null,null,null,null,"通所介護事業所（大規模型（Ⅱ））",1480,"/事業所",null,200,"/事業所"]
["所在地",null,null,"郵便番号",null,null,null,"都道府県名",null,null,null,"住所",null,null,null,null,null,null,null,null,null,null,null,null,null,"連絡先",null,null,"電話番号",null,null,null,null,"担当部署名",null,null,null,null,null,null,null,null,null,null,null,null,null,null,null,null,null,null,null,null,null,null,null,null,null,null,null,null,null,null,null,null,null,null,null,null,null,null,null,null,null,null,null,null,"地域密着型通所介護事業所(療養通所介護事業所を含む)",384,"/事業所",null,200,"/事業所"]
[null,null,null,"980-8570",null,null,null,"宮城県",null,null,null,"仙台市青葉区本町３丁目８－１",null,null,null,null,null,null,null,null,null,null,null,null,null,null,null,null,"022-211-2549",null,null,null,null,"施設支援班",null,null,null,null,null,null,null,null,null,null,null,null,null,null,null,null,null,null,null,null,null,null,null,null,null,null,null,null,null,null,null,null,null,null,null,null,null,null,null,null,null,null,null,null,"認知症対応型通所介護事業所",375,"/事業所",null,200,"/事業所"]
["提供サービス",null,null,null,null,null,null,"居宅介護支援事業所",null,null,null,null,null,null,null,null,null,null,null,null,null,null,null,null,null,"定員",null,null,null,null,"人",null,null,null,null,null,null,null,null,null,null,null,null,null,null,null,null,null,null,null,null,null,null,null,null,null,null,null,null,null,null,null,null,null,null,null,null,null,null,null,null,null,null,null,null,null,null,null,"通所リハビリテーション事業所（通常規模型）",939,"/事業所",null,200,"/事業所"]
{"$rows_left_out":50}
{"sheet":"職員表","index":4,"n_rows":505,"n_cols":21,"rows_kept":505,"cut":false,"hidden":false,"merged":[[3,15,3,18],[3,19,3,20],[3,0,4,0],[3,6,4,6],[3,7,3,9],[3,14,4,14],[3,1,4,1],[3,2,4,2],[3,3,4,3],[3,10,3,13]]}
["介護慰労金受給職員表（法人単位）"]
[]
["※　本表は法人単位でまとめて記載すること。"]
[null,"氏名\n（漢字）","氏名\n（全角カナ）","生年月日\n（西暦）",null,null,"本人の住所","主たる勤務先",null,null,"分類",null,null,null,"慰労金\n(万円)","確認事項",null,null,null,"支払実績"]
[null,null,null,null,"（確認用）","（確認用）",null,"事業所番号","サービス種類コード","事業所・施設の名称","施設区分","対応区分","(計算用)","他の施設等との期間通算がある場合その施設名",null,"委任状の有無","他法人での慰労金の受給の有無","業務委託による\n従事者","重複\n受給者確認用","支払年月日\n(西暦)","支払金額\n（円）"]
[{"$f":"ROW()-5","v":1},"長寿一郎","チョウジュイチロウ","1970-01-01",{"$f":"B6&C6&D6","v":"長寿一郎チョウジュイチロウ25569"},{"$f":"IF(E6=\"\",\"\",COUNTIF($E$6:$E$1385,E6))","v":1},"仙台市青葉区本町３丁目８－１","0420123456","51","特別養護老人ホーム長寿社会政策課","その他の施設","対象期間に10日以上勤務",{"$f":"K6&L6","v":"その他の施設対象期間に10日以上勤務"},null,{"$f":"IFERROR(VLOOKUP(M6,計算用!$A$8:$B$15,2,FALSE),\"\")","v":5},"あり","なし",null,{"$f":"IF(F6>=2,\"\",\"可\")","v":"可"},"2020-12-05",50000]
[{"$f":"ROW()-5","v":2},"長寿二郎","チョウジュジロウ","1974-02-10",{"$f":"B7&C7&D7","v":"長寿二郎チョウジュジロウ27070"},{"$f":"IF(E7=\"\",\"\",COUNTIF($E$6:$E$1385,E7))","v":1},"仙台市青葉区本町３丁目８－１","0420123456","51","特別養護老人ホーム長寿社会政策課","その他の施設","対象期間に10日以上勤務",{"$f":"K7&L7","v":"その他の施設対象期間に10日以上勤務"},null,{"$f":"IFERROR(VLOOKUP(M7,計算用!$A$8:$B$15,2,FALSE),\"\")","v":5},"あり","なし",null,{"$f":"IF(F7>=2,\"\",\"可\")","v":"可"},"2020-12-05",50000]
[3,"長寿三郎","チョウジュサブロウ","1978-03-20",{"$f":"B8&C8&D8","v":"長寿三郎チョウジュサブロウ28569"},{"$f":"IF(E8=\"\",\"\",COUNTIF($E$6:$E$1385,E8))","v":1},"仙台市青葉区本町３丁目８－１","0420123456","51","特別養護老人ホーム長寿社会政策課","その他の施設","対象期間に10日以上勤務",{"$f":"K8&L8","v":"その他の施設対象期間に10日以上勤務"},null,{"$f":"IFERROR(VLOOKUP(M8,計算用!$A$8:$B$15,2,FALSE),\"\")","v":5},"あり","なし","該当",{"$f":"IF(F8>=2,\"\",\"可\")","v":"可"},"2020-12-05",50000]
[4,"長寿四郎","チョウジュシロウ","1982-04-12",{"$f":"B9&C9&D9","v":"長寿四郎チョウジュシロウ30053"},{"$f":"IF(E9=\"\",\"\",COUNTIF($E$6:$E$1385,E9))","v":1},"仙台市青葉区本町３丁目８－１","0420123999","43","居宅介護支援事業所長寿社会政策課","その他の施設","対象期間に10日以上勤務",{"$f":"K9&L9","v":"その他の施設対象期間に10日以上勤務"},null,{"$f":"IFERROR(VLOOKUP(M9,計算用!$A$8:$B$15,2,FALSE),\"\")","v":5},"あり","なし",null,{"$f":"IF(F9>=2,\"\",\"可\")","v":"可"},"2020-12-05",50000]
[5,"長寿五郎","チョウジュゴロウ","1988-12-13",{"$f":"B10&C10&D10","v":"長寿五郎チョウジュゴロウ32490"},{"$f":"IF(E10=\"\",\"\",COUNTIF($E$6:$E$1385,E10))","v":1},"仙台市青葉区本町３丁目８－１","0420123999","43","居宅介護支援事業所長寿社会政策課","その他の施設","対象期間に10日以上勤務",{"$f":"K10&L10","v":"その他の施設対象期間に10日以上勤務"},null,{"$f":"IFERROR(VLOOKUP(M10,計算用!$A$8:$B$15,2,FALSE),\"\")","v":5},"あり","なし",null,{"$f":"IF(F10>=2,\"\",\"可\")","v":"可"},"2020-12-05",50000]
{"$rows_left_out":496}
{"sheet":"実績額一覧","index":5,"n_rows":107,"n_cols":39,"rows_kept":107,"cut":false,"hidden":false,"merged":[[2,4,3,4],[2,8,2,12],[2,0,3,0],[2,1,3,1],[2,2,3,2],[2,3,3,3],[2,7,3,7],[2,6,3,6],[2,5,3,5]]}
["事業所・施設別実績額一覧（サービス別一覧）"]
[]
["No.","介護保険\n事業所番号","事業所・施設名","サービス種別","事業所の\n電話番号","事業所の\n郵便番号","事業所の住所","法人名","実績額（千円）"]
[null,null,null,null,null,null,null,null,"介護\n慰労金","感染対策\n費用助成\n事業","個別再開\n支援助成\n事業","再開環境\n整備助成\n事業","小計",null,null,null,null,null,null,null,null,null,null,null,null,null,null,null,null,null,null,null,null,null,null,"20万","5万"]
[{"$f":"ROW()-4","v":1},{"$f":"IFERROR(INDIRECT(\"個票\"&$A5&\"！$h$7\"),\"\")","v":"0420123456"},{"$f":"IFERROR(INDIRECT(\"個票\"&$A5&\"！$t$7\"),\"\")","v":"特別養護老人ホーム長寿社会政策課"},{"$f":"IFERROR(INDIRECT(\"個票\"&$A5&\"！$h$10\"),\"\")","v":"介護老人福祉施設"},{"$f":"IFERROR(INDIRECT(\"個票\"&$A5&\"！$AC$9\"),\"\")","v":"022-211-2549"},{"$f":"IFERROR(INDIRECT(\"個票\"&$A5&\"！$d$9\"),\"\")","v":"980-8570"},{"$f":"IFERROR(INDIRECT(\"個票\"&$A5&\"！$H$9\")&INDIRECT(\"個票\"&$A5&\"！$L$9\"),\"\")","v":"宮城県仙台市青葉区本町３丁目８－１"},{"$f":"IF(M5>0,実績報告書!$W$8,\"\")","v":"社会福祉法人宮城県"},{"$f":"IFERROR(INDIRECT(\"個票\"&$A5&\"！$ag$17\"),\"\")","v":151},{"$f":"IFERROR(INDIRECT(\"個票\"&$A5&\"！$ag$22\"),\"\")","v":1529},{"$f":"IFERROR(INDIRECT(\"個票\"&$A5&\"！$ag$37\"),\"\")","v":0},{"$f":"IFERROR(INDIRECT(\"個票\"&$A5&\"！$ag$47\"),\"\")","v":0},{"$f":"SUM(I5,J5,K5,L5)","v":1680},null,null,{"$f":"IF(_xlfn.SHEETS()-6=COUNTIF(M5:M107,\">0\"),\"○\",\"！（本表の事業所数と個票の枚数が一致しません）\")","v":"○"},null,null,null,null,null,null,null,null,null,null,null,null,null,null,null,null,null,null,null,{"$f":"IFERROR(INDIRECT(\"個票\"&$A5&\"！$m$19\"),\"\")","v":0},{"$f":"IFERROR(INDIRECT(\"個票\"&$A5&\"！$v$19\"),\"\")","v":3},{"$f":"IFERROR(INDIRECT(\"個票\"&$A5&\"！$m$19\"),\"\")","v":0},{"$f":"IFERROR(INDIRECT(\"個票\"&$A5&\"！$m$19\"),\"\")","v":0}]
[{"$f":"ROW()-4","v":2},{"$f":"IFERROR(INDIRECT(\"個票\"&$A6&\"！$h$7\"),\"\")","v":"0420123999"},"居宅介護支援事業所長寿社会政策課","居宅介護支援事業所","022-211-2549","980-8570","宮城県仙台市青葉区本町３丁目８－１",{"$f":"IF(M6>0,実績報告書!$W$8,\"\")","v":"社会福祉法人宮城県"},{"$f":"IFERROR(INDIRECT(\"個票\"&$A6&\"！$ag$17\"),\"\")","v":100},{"$f":"IFERROR(INDIRECT(\"個票\"&$A6&\"！$ag$22\"),\"\")","v":177},{"$f":"IFERROR(INDIRECT(\"個票\"&$A6&\"！$ag$37\"),\"\")","v":19.5},{"$f":"IFERROR(INDIRECT(\"個票\"&$A6&\"！$ag$47\"),\"\")","v":152},448.5,null,null,null,null,null,null,null,null,null,null,null,null,null,null,null,null,null,null,null,null,null,null,{"$f":"IFERROR(INDIRECT(\"個票\"&$A6&\"！$m$19\"),\"\")","v":0},{"$f":"IFERROR(INDIRECT(\"個票\"&$A6&\"！$v$19\"),\"\")","v":2},{"$f":"IFERROR(INDIRECT(\"個票\"&$A6&\"！$m$18\"),\"\")","v":0},{"$f":"IFERROR(INDIRECT(\"個票\"&$A6&\"！$v$18\"),\"\")","v":0}]
[3,"","","","","","",{"$f":"IF(M7>0,実績報告書!$W$8,\"\")","v":""},"","","","",0,null,null,null,null,null,null,null,null,null,null,null,null,null,null,null,null,null,null,null,null,null,null,"","","",""]
[4,"","","","","","",{"$f":"IF(M8>0,実績報告書!$W$8,\"\")","v":""},"","","","",0,null,null,null,null,null,null,null,null,null,null,null,null,null,null,null,null,null,null,null,null,null,null,"","","",""]
[5,"","","","","","",{"$f":"IF(M9>0,実績報告書!$W$8,\"\")","v":""},"","","","",0,null,null,null,null,null,null,null,null,null,null,null,null,null,null,null,null,null,null,null,null,null,null,"","","",""]
[6,"","","","","","",{"$f":"IF(M10>0,実績報告書!$W$8,\"\")","v":""},"","","","",0,null,null,null,null,null,null,null,null,null,null,null,null,null,null,null,null,null,null,null,null,null,null,"","","",""]
{"$rows_left_out":98}
{"sheet":"法人実績額内訳","index":6,"n_rows":9,"n_cols":2,"rows_kept":9,"cut":false,"hidden":false,"merged":[[2,1,3,1],[2,0,3,0]]}
["法人実績額内訳"]
[null,"（単位：千円）"]
[null,"実績額"]
[]
["介護慰労金事業",{"$f":"SUM(実績額一覧!I5:I104)","v":251}]
["感染症対策を徹底した上での\n介護サービス提供支援事業",{"$f":"SUM(実績額一覧!J5:J104)","v":1706}]
["在宅サービス事業所による\n利用者への再開支援への助成事業",{"$f":"SUM(実績額一覧!K5:K104)","v":19.5}]
["在宅サービス事業所における\n環境整備への助成事業",{"$f":"SUM(実績額一覧!L5:L104)","v":152}]
["合計",{"$f":"SUM(B5:B8)","v":2128.5}]

{"sheet":"計算用","index":7,"n_rows":67,"n_cols":8,"rows_kept":67,"cut":false,"hidden":true,"merged":[]}
[null,null,null,null,null,null,null,"※本シートは絶対に編集しないこと。"]
["施設区分"]
["陽性者(濃厚接触者)発生施設","通所系･施設系で1日以上勤務又は訪問系で陽性者等に1日以上対応","訪問系で陽性者等への対応はないが対象期間に10日以上勤務","対象期間の勤務が９日以下"]
["その他の施設","対象期間に10日以上勤務","対象期間の勤務が9日以下"]
[]
[]
["慰労金単価"]
[{"$f":"A3&B3","v":"陽性者(濃厚接触者)発生施設通所系･施設系で1日以上勤務又は訪問系で陽性者等に1日以上対応"},20]
[{"$f":"A3&C3","v":"陽性者(濃厚接触者)発生施設訪問系で陽性者等への対応はないが対象期間に10日以上勤務"},5]
[{"$f":"A3&D3","v":"陽性者(濃厚接触者)発生施設対象期間の勤務が９日以下"},0]
{"$rows_left_out":57}